Reaction Details
TargetPeptidylglycine alpha-amidating monooxygenase
LigandBDBM50030345
Substrate/Competitorn/a
Meas. Tech.ChEMBL_154488 (CHEMBL765265)
IC50>10000±n/a nM
Citation Erion, MDTan, JWong, MJeng, AY Inhibition of peptidylglycine alpha-amidating monooxygenase by N-substituted homocysteine analogs. J Med Chem37:4430-7 (1995) Peptidylglycine alpha-amidating monooxygenase
Name:Peptidylglycine alpha-amidating monooxygenase
Type:PROTEIN
Mol. Mass.:108665.78
Organism:Rattus norvegicus
Description:ChEMBL_536304
Residue:976
BDBM50030345
NameBDBM50030345
Synonyms:(S)-N-(2-Oxo-tetrahydro-thiophen-3-yl)-3-phenyl-2-(3-phenyl-propionylamino)-propionamide | CHEMBL137827
TypeSmall organic molecule
Emp. Form.C22H24N2O3S
Mol. Mass.396.503
SMILESO=C(CCc1ccccc1)N[C@@H](Cc1ccccc1)C(=O)NC1CCSC1=O