Reaction Details
TargetPeptidylglycine alpha-amidating monooxygenase
LigandBDBM50030358
Substrate/Competitorn/a
Meas. Tech.ChEMBL_154488 (CHEMBL765265)
IC50 7500±n/a nM
Citation Erion, MDTan, JWong, MJeng, AY Inhibition of peptidylglycine alpha-amidating monooxygenase by N-substituted homocysteine analogs. J Med Chem37:4430-7 (1995) Peptidylglycine alpha-amidating monooxygenase
Name:Peptidylglycine alpha-amidating monooxygenase
Type:PROTEIN
Mol. Mass.:108665.78
Organism:Rattus norvegicus
Description:ChEMBL_536304
Residue:976
BDBM50030358
NameBDBM50030358
Synonyms:4-Mercapto-2-(3-phenyl-propionylamino)-butyric acid | CHEMBL342584
TypeSmall organic molecule
Emp. Form.C13H17NO3S
Mol. Mass.267.344
SMILESOC(=O)C(CCS)NC(=O)CCc1ccccc1