Reaction Details
TargetPeptidylglycine alpha-amidating monooxygenase
LigandBDBM50030363
Substrate/Competitorn/a
Meas. Tech.ChEMBL_154488 (CHEMBL765265)
IC50 18±n/a nM
Citation Erion, MDTan, JWong, MJeng, AY Inhibition of peptidylglycine alpha-amidating monooxygenase by N-substituted homocysteine analogs. J Med Chem37:4430-7 (1995) Peptidylglycine alpha-amidating monooxygenase
Name:Peptidylglycine alpha-amidating monooxygenase
Type:PROTEIN
Mol. Mass.:108665.78
Organism:Rattus norvegicus
Description:ChEMBL_536304
Residue:976
BDBM50030363
NameBDBM50030363
Synonyms:(S)-2-((S)-2-Benzyloxycarbonylamino-3-phenyl-propionylamino)-4-mercapto-butyric acid | CHEMBL277080
TypeSmall organic molecule
Emp. Form.C21H24N2O5S
Mol. Mass.416.491
SMILESOC(=O)[C@H](CCS)NC(=O)[C@H](Cc1ccccc1)NC(=O)OCc1ccccc1