Reaction Details
TargetPeptidylglycine alpha-amidating monooxygenase
LigandBDBM50030364
Substrate/Competitorn/a
Meas. Tech.ChEMBL_154488 (CHEMBL765265)
IC50 55±n/a nM
Citation Erion, MDTan, JWong, MJeng, AY Inhibition of peptidylglycine alpha-amidating monooxygenase by N-substituted homocysteine analogs. J Med Chem37:4430-7 (1995) Peptidylglycine alpha-amidating monooxygenase
Name:Peptidylglycine alpha-amidating monooxygenase
Type:PROTEIN
Mol. Mass.:108665.78
Organism:Rattus norvegicus
Description:ChEMBL_536304
Residue:976
BDBM50030364
NameBDBM50030364
Synonyms:2-{(S)-2-[3-(3,4-Dichloro-phenyl)-propionylamino]-3-phenyl-propionylamino}-4-mercapto-butyric acid | CHEMBL139002
TypeSmall organic molecule
Emp. Form.C22H24Cl2N2O4S
Mol. Mass.483.408
SMILESOC(=O)C(CCS)NC(=O)[C@H](Cc1ccccc1)NC(=O)CCc1ccc(Cl)c(Cl)c1