Reaction Details
TargetPeptidylglycine alpha-amidating monooxygenase
LigandBDBM50030371
Substrate/Competitorn/a
Meas. Tech.ChEMBL_154488 (CHEMBL765265)
IC50>10000±n/a nM
Citation Erion, MDTan, JWong, MJeng, AY Inhibition of peptidylglycine alpha-amidating monooxygenase by N-substituted homocysteine analogs. J Med Chem37:4430-7 (1995) Peptidylglycine alpha-amidating monooxygenase
Name:Peptidylglycine alpha-amidating monooxygenase
Type:PROTEIN
Mol. Mass.:108665.78
Organism:Rattus norvegicus
Description:ChEMBL_536304
Residue:976
BDBM50030371
NameBDBM50030371
Synonyms:(S)-2-[(S)-3-Phenyl-2-(3-phenyl-propionylamino)-propionylamino]-succinamic acid | CHEMBL137901
TypeSmall organic molecule
Emp. Form.C22H25N3O5
Mol. Mass.411.451
SMILESNC(=O)C[C@H](NC(=O)[C@H](Cc1ccccc1)NC(=O)CCc1ccccc1)C(O)=O