Reaction Details
TargetPeptidylglycine alpha-amidating monooxygenase
LigandBDBM50030372
Substrate/Competitorn/a
Meas. Tech.ChEMBL_154488 (CHEMBL765265)
IC50 8±n/a nM
Citation Erion, MDTan, JWong, MJeng, AY Inhibition of peptidylglycine alpha-amidating monooxygenase by N-substituted homocysteine analogs. J Med Chem37:4430-7 (1995) Peptidylglycine alpha-amidating monooxygenase
Name:Peptidylglycine alpha-amidating monooxygenase
Type:PROTEIN
Mol. Mass.:108665.78
Organism:Rattus norvegicus
Description:ChEMBL_536304
Residue:976
BDBM50030372
NameBDBM50030372
Synonyms:2-{(S)-2-[(1H-Indole-2-carbonyl)-amino]-3-phenyl-propionylamino}-4-mercapto-butyric acid | CHEMBL138076
TypeSmall organic molecule
Emp. Form.C22H23N3O4S
Mol. Mass.425.501
SMILESOC(=O)C(CCS)NC(=O)[C@H](Cc1ccccc1)NC(=O)c1cc2ccccc2[nH]1