Reaction Details
TargetSubstance-P receptor
LigandBDBM50000040
Substrate/Competitorn/a
Meas. Tech.ChEMBL_205571 (CHEMBL807904)
IC50 0.45±n/a nM
Citation MacLeod, AMCascieri, MAMerchant, KJSadowski, SHardwicke, SLewis, RTMacIntyre, DEMetzger, JMFong, TMShepheard, S Synthesis and biological evaluation of NK1 antagonists derived from L-tryptophan. J Med Chem38:934-41 (1995) Substance-P receptor
Name:Substance-P receptor
Type:G Protein-Coupled Receptor (GPCR)
Mol. Mass.:46254.43
Organism:Homo sapiens (Human)
Description:P25103
Residue:407
BDBM50000040
NameBDBM50000040
Synonyms:((2S,3S)-2-Benzhydryl-1-aza-bicyclo[2.2.2]oct-3-yl)-(2-methoxy-benzyl)-amine (+)(2-Benzhydryl-1-aza-bicyclo[2.2.2]oct-3-yl)-(2-methoxy-benzyl)-amine (2-Benzhydryl-1-aza-bicyclo[2.2.2]oct-3-yl)-(2-methoxy-benzyl)-amine CP-96,345 i(2-Benzhydryl-1-aza-bicyclo[2.2.2]oct-3-yl)-(2-methoxy-benzyl)-amine
TypeSmall organic molecule
Emp. Form.C28H32N2O
Mol. Mass.412.5665
SMILESCOc1ccccc1CN[C@H]1C2CCN(CC2)[C@H]1C(c1ccccc1)c1ccccc1