Reaction Details
TargetReverse transcriptase/RNaseH
LigandBDBM50285359
Substrate/Competitorn/a
Meas. Tech.ChEMBL_195068 (CHEMBL797523)
IC50 1300±n/a nM
Citation Proudfoot, JRPatel, URKapadia, SRHargrave, KD Novel non-nucleoside inhibitors of HIV-1 reverse transcriptase. 3. Dipyrido[2,3-b:2',3'-e]diazepinones. J Med Chem38:1406-10 (1995) Reverse transcriptase/RNaseH
Name:Reverse transcriptase/RNaseH
Type:PROTEIN
Mol. Mass.:65229.15
Organism:Human immunodeficiency virus 1
Description:ChEMBL_1473730
Residue:566
BDBM50285359
NameBDBM50285359
Synonyms:5-Ethyl-11-methyl-5,11-dihydro-1,5,6,11-tetraaza-dibenzo[a,d]cyclohepten-10-one | CHEMBL298243
TypeSmall organic molecule
Emp. Form.C14H14N4O
Mol. Mass.254.2872
SMILESCCN1c2cccnc2N(C)C(=O)c2cccnc12