Reaction Details
TargetReverse transcriptase/RNaseH
LigandBDBM50407744
Substrate/Competitorn/a
Meas. Tech.ChEMBL_195068 (CHEMBL797523)
IC50 190±n/a nM
Citation Proudfoot, JRPatel, URKapadia, SRHargrave, KD Novel non-nucleoside inhibitors of HIV-1 reverse transcriptase. 3. Dipyrido[2,3-b:2',3'-e]diazepinones. J Med Chem38:1406-10 (1995) Reverse transcriptase/RNaseH
Name:Reverse transcriptase/RNaseH
Type:PROTEIN
Mol. Mass.:65229.15
Organism:Human immunodeficiency virus 1
Description:ChEMBL_1473730
Residue:566
BDBM50407744
NameBDBM50407744
Synonyms:CHEMBL2115336
TypeSmall organic molecule
Emp. Form.C16H18N4O
Mol. Mass.282.3403
SMILESCCN1c2cc(C)c(C)nc2N(C)C(=O)c2cccnc12