Reaction Details
TargetReverse transcriptase/RNaseH
LigandBDBM50407745
Substrate/Competitorn/a
Meas. Tech.ChEMBL_195068 (CHEMBL797523)
IC50 550±n/a nM
Citation Proudfoot, JRPatel, URKapadia, SRHargrave, KD Novel non-nucleoside inhibitors of HIV-1 reverse transcriptase. 3. Dipyrido[2,3-b:2',3'-e]diazepinones. J Med Chem38:1406-10 (1995) Reverse transcriptase/RNaseH
Name:Reverse transcriptase/RNaseH
Type:PROTEIN
Mol. Mass.:65229.15
Organism:Human immunodeficiency virus 1
Description:ChEMBL_1473730
Residue:566
BDBM50407745
NameBDBM50407745
Synonyms:CHEMBL2115335
TypeSmall organic molecule
Emp. Form.C14H13BrN4O
Mol. Mass.333.183
SMILESCCN1c2cc(Br)cnc2N(C)C(=O)c2cccnc12