Reaction Details
TargetReverse transcriptase/RNaseH
LigandBDBM50030548
Substrate/Competitorn/a
Meas. Tech.ChEMBL_195358 (CHEMBL802598)
IC50>100000±n/a nM
Citation Maruenda, HJohnson, F Design and synthesis of novel inhibitors of HIV-1 reverse transcriptase. J Med Chem38:2145-51 (1995) Reverse transcriptase/RNaseH
Name:Reverse transcriptase/RNaseH
Type:PROTEIN
Mol. Mass.:65229.15
Organism:Human immunodeficiency virus 1
Description:ChEMBL_1473730
Residue:566
BDBM50030548
NameBDBM50030548
Synonyms:4-(2-Hydroxy-ethoxymethyl)-11-(4-nitro-phenyl)-10,11-dihydro-4H-5-thia-2,4,10-triaza-dibenzo[a,d]cycloheptene-1,3-dione | CHEMBL66016
TypeSmall organic molecule
Emp. Form.C20H18N4O6S
Mol. Mass.442.445
SMILESOCCOCn1c2Sc3ccccc3NC(c3ccc(cc3)[N+]([O-])=O)c2c(=O)[nH]c1=O