Reaction Details
TargetGag-Pol polyprotein [489-587]
LigandBDBM50030566
Substrate/Competitorn/a
Meas. Tech.ChEMBL_195214 (CHEMBL800925)
IC50 2200±n/a nM
Citation Xie, LXie, JXKashiwada, YCosentino, LMLiu, SHPai, RBCheng, YCLee, KH Anti-AIDS (acquired immune deficiency syndrome) agents. 17. New brominated hexahydroxybiphenyl derivatives as potent anti-HIV agents. J Med Chem38:3003-8 (1995) Gag-Pol polyprotein [489-587]
Name:Gag-Pol polyprotein [489-587]
Type:Enzyme Subunit
Mol. Mass.:10781.16
Organism:Human immunodeficiency virus type 1
Description:P04585[489-587]
Residue:99
BDBM50030566
NameBDBM50030566
Synonyms:6-Bromo-7,7'-dimethoxy-[4,4']bi[benzo[1,3]dioxolyl]-5,5'-dicarboxylic acid dimethyl ester | CHEMBL317773
TypeSmall organic molecule
Emp. Form.C20H17BrO10
Mol. Mass.497.247
SMILESCOC(=O)c1cc(OC)c2OCOc2c1-c1c2OCOc2c(OC)c(Br)c1C(=O)OC