Reaction Details
TargetMetabotropic glutamate receptor 2
LigandBDBM50030627
Substrate/Competitorn/a
Meas. Tech.ChEMBL_219004 (CHEMBL818772)
IC50 340000±n/a nM
Citation Pellicciari, RLuneia, RCostantino, GMarinozzi, MNatalini, BJakobsen, PKanstrup, ALombardi, GMoroni, FThomsen, C 1-Aminoindan-1,5-dicarboxylic acid: a novel antagonist at phospholipase C-linked metabotropic glutamate receptors. J Med Chem38:3717-9 (1995) Metabotropic glutamate receptor 2
Name:Metabotropic glutamate receptor 2
Type:Enzyme
Mol. Mass.:95584.88
Organism:Homo sapiens (Human)
Description:Q14416
Residue:872
BDBM50030627
NameBDBM50030627
Synonyms:(+-)-MCPG 4-(1-Amino-1-carboxy-ethyl)-benzoic acid CHEMBL299683 | MCPG
TypeSmall organic molecule
Emp. Form.C10H11NO4
Mol. Mass.209.1986
SMILESCC(N)(C(O)=O)c1ccc(cc1)C(O)=O