Reaction Details
TargetType-1 angiotensin II receptor
LigandBDBM50030687
Substrate/Competitorn/a
Meas. Tech.ChEMBL_36791 (CHEMBL650312)
IC50 0.430000±n/a nM
Citation Chang, LLAshton, WTFlanagan, KLChen, TBO'Malley, SSZingaro, GJKivlighn, SDSiegl, PKLotti, VJChang, RS Potent and orally active angiotensin II receptor antagonists with equal affinity for human AT1 and AT2 subtypes. J Med Chem38:3741-58 (1995) Type-1 angiotensin II receptor
Name:Type-1 angiotensin II receptor
Type:Protein
Mol. Mass.:41080.75
Organism:Homo sapiens (Human)
Description:P30556
Residue:359
BDBM50030687
NameBDBM50030687
Synonyms:CHEMBL339256 | N-(3-{3-Butyl-4-[2'-(2-chloro-benzoylsulfamoyl)-3-fluoro-biphenyl-4-ylmethyl]-5-oxo-4,5-dihydro-[1,2,4]triazol-1-yl}-4-trifluoromethyl-phenyl)-propionamide
TypeSmall organic molecule
Emp. Form.C36H32ClF4N5O5S
Mol. Mass.758.181
SMILESCCCCc1nn(-c2cc(NC(=O)CC)ccc2C(F)(F)F)c(=O)n1Cc1ccc(cc1F)-c1ccccc1S(=O)(=O)NC(=O)c1ccccc1Cl