Reaction Details
TargetType-2 angiotensin II receptor
LigandBDBM50030707
Substrate/Competitorn/a
Meas. Tech.ChEMBL_35412 (CHEMBL643586)
IC50 0.160000±n/a nM
Citation Chang, LLAshton, WTFlanagan, KLChen, TBO'Malley, SSZingaro, GJKivlighn, SDSiegl, PKLotti, VJChang, RS Potent and orally active angiotensin II receptor antagonists with equal affinity for human AT1 and AT2 subtypes. J Med Chem38:3741-58 (1995) Type-2 angiotensin II receptor
Name:Type-2 angiotensin II receptor
Type:Enzyme Catalytic Domain
Mol. Mass.:41346.62
Organism:RAT
Description:Angiotensin II AT2 0 0::P35351
Residue:363
BDBM50030707
NameBDBM50030707
Synonyms:CHEMBL122273 | Pentanoic acid (4-bromo-3-{3-ethyl-4-[3-fluoro-2'-(2-fluoro-benzoylsulfamoyl)-biphenyl-4-ylmethyl]-5-oxo-4,5-dihydro-[1,2,4]triazol-1-yl}-phenyl)-amide
TypeSmall organic molecule
Emp. Form.C35H32BrF2N5O5S
Mol. Mass.752.625
SMILESCCCCC(=O)Nc1ccc(Br)c(c1)-n1nc(CC)n(Cc2ccc(cc2F)-c2ccccc2S(=O)(=O)NC(=O)c2ccccc2F)c1=O