Reaction Details
TargetUridine phosphorylase 1
LigandBDBM50031009
Substrate/Competitorn/a
Meas. Tech.ChEMBL_212951 (CHEMBL873996)
IC50 66.0±n/a nM
Citation Orr, GFMusso, DLBoswell, GEKelley, JLJoyner, SSDavis, STBaccanari, DP Inhibition of uridine phosphorylase: synthesis and structure-activity relationships of aryl-substituted 5-benzyluracils and 1-[(2-hydroxyethoxy)methyl]-5-benzyluracils. J Med Chem38:3850-6 (1995) Uridine phosphorylase 1
Name:Uridine phosphorylase 1
Type:PROTEIN
Mol. Mass.:34086.29
Organism:Mus musculus
Description:ChEMBL_212951
Residue:311
BDBM50031009
NameBDBM50031009
Synonyms:1-(2-Hydroxy-ethoxymethyl)-5-(3-isobutoxy-benzyl)-1H-pyrimidine-2,4-dione | CHEMBL445839
TypeSmall organic molecule
Emp. Form.C18H24N2O5
Mol. Mass.348.3936
SMILESCC(C)COc1cccc(Cc2cn(COCCO)c(=O)[nH]c2=O)c1