Reaction Details
TargetNeutrophil elastase
LigandBDBM50031197
Substrate/Competitorn/a
Meas. Tech.ChEMBL_63969 (CHEMBL677437)
Ki 0.35±n/a nM
Citation Edwards, PDZottola, MADavis, MWilliams, JTuthill, PA Peptidyl alpha-ketoheterocyclic inhibitors of human neutrophil elastase. 3. In vitro and in vivo potency of a series of peptidyl alpha-ketobenzoxazoles. J Med Chem38:3972-82 (1995) Neutrophil elastase
Name:Neutrophil elastase
Type:Enzyme
Mol. Mass.:28532.38
Organism:Homo sapiens (Human)
Description:P08246
Residue:267
BDBM50031197
NameBDBM50031197
Synonyms:2-[(S)-3-Methyl-2-({(S)-1-[(S)-3-methyl-2-(4-sulfamoyl-benzoylamino)-butyryl]-pyrrolidine-2-carbonyl}-amino)-butyryl]-benzooxazole-5-carboxylic acid methyl ester | CHEMBL337931
TypeSmall organic molecule
Emp. Form.C31H37N5O9S
Mol. Mass.655.719
SMILESCOC(=O)c1ccc2oc(nc2c1)C(=O)[C@@H](NC(=O)[C@@H]1CCCN1C(=O)[C@@H](NC(=O)c1ccc(cc1)S(N)(=O)=O)C(C)C)C(C)C