Reaction Details
TargetNeutrophil elastase
LigandBDBM50031203
Substrate/Competitorn/a
Meas. Tech.ChEMBL_63969 (CHEMBL677437)
Ki 0.18±n/a nM
Citation Edwards, PDZottola, MADavis, MWilliams, JTuthill, PA Peptidyl alpha-ketoheterocyclic inhibitors of human neutrophil elastase. 3. In vitro and in vivo potency of a series of peptidyl alpha-ketobenzoxazoles. J Med Chem38:3972-82 (1995) Neutrophil elastase
Name:Neutrophil elastase
Type:Enzyme
Mol. Mass.:28532.38
Organism:Homo sapiens (Human)
Description:P08246
Residue:267
BDBM50031203
NameBDBM50031203
Synonyms:2-{(S)-2-[((S)-1-{(S)-2-[4-(4-Chloro-benzenesulfonylaminocarbonyl)-benzoylamino]-3-methyl-butyryl}-pyrrolidine-2-carbonyl)-amino]-3-methyl-butyryl}-benzooxazole-6-carboxylic acid methyl ester methyl 2-((S)-2-((S)-1-((S)-2-(4-(carbamoyl)benzamido)-3-methylbutanoyl)pyrrolidine-2-carboxamido)-3-methylbutanoyl)benzo[d]oxazole-6-carboxylate
TypeSmall organic molecule
Emp. Form.C38H40ClN5O10S
Mol. Mass.794.27
SMILESCOC(=O)c1ccc2nc(oc2c1)C(=O)[C@@H](NC(=O)[C@@H]1CCCN1C(=O)[C@@H](NC(=O)c1ccc(cc1)C(=O)NS(=O)(=O)c1ccc(Cl)cc1)C(C)C)C(C)C