Reaction Details
TargetNeutrophil elastase
LigandBDBM50031217
Substrate/Competitorn/a
Meas. Tech.ChEMBL_63969 (CHEMBL677437)
Ki 0.34±n/a nM
Citation Edwards, PDZottola, MADavis, MWilliams, JTuthill, PA Peptidyl alpha-ketoheterocyclic inhibitors of human neutrophil elastase. 3. In vitro and in vivo potency of a series of peptidyl alpha-ketobenzoxazoles. J Med Chem38:3972-82 (1995) Neutrophil elastase
Name:Neutrophil elastase
Type:Enzyme
Mol. Mass.:28532.38
Organism:Homo sapiens (Human)
Description:P08246
Residue:267
BDBM50031217
NameBDBM50031217
Synonyms:CHEMBL262516 tert-butyl 4-(((S)-1-((S)-2-(((S)-1-(benzo[d]oxazol-2-yl)-3-methyl-1-oxobutan-2-yl)carbamoyl)pyrrolidin-1-yl)-3-methyl-1-oxobutan-2-yl)carbamoyl)benzoate
TypeSmall organic molecule
Emp. Form.C34H42N4O7
Mol. Mass.618.7199
SMILESCC(C)[C@H](NC(=O)c1ccc(cc1)C(=O)OC(C)(C)C)C(=O)N1CCC[C@H]1C(=O)N[C@@H](C(C)C)C(=O)c1nc2ccccc2o1