Reaction Details
TargetAlpha-2A adrenergic receptor
LigandBDBM50031308
Substrate/Competitorn/a
Meas. Tech.ChEMBL_33073 (CHEMBL648169)
Ki 51±n/a nM
Citation Cordi, AALacoste, JMDescombes, JJCourchay, CVanhoutte, PMLaubie, MVerbeuren, TJ Design, synthesis, and structure-activity relationships of a new series of alpha-adrenergic agonists: spiro[(1,3-diazacyclopent-1-ene)-5,2'-(1',2',3',4'- tetrahydronaphthalene)]. J Med Chem38:4056-69 (1995) Alpha-2A adrenergic receptor
Name:Alpha-2A adrenergic receptor
Type:Enzyme
Mol. Mass.:48979.91
Organism:Homo sapiens (Human)
Description:P08913
Residue:465
BDBM50031308
NameBDBM50031308
Synonyms:7'-methoxyspiro[4,5-dihydro-1H-imidazole-4,2'-(1',2',3',4'-tetrahydronaphthalene)] | CHEMBL133579
TypeSmall organic molecule
Emp. Form.C13H16N2O
Mol. Mass.216.2789
SMILESCOc1ccc2CCC3(CNC=N3)Cc2c1