Reaction Details
TargetAlpha-2A adrenergic receptor
LigandBDBM50031311
Substrate/Competitorn/a
Meas. Tech.ChEMBL_33073 (CHEMBL648169)
Ki 7.0±n/a nM
Citation Cordi, AALacoste, JMDescombes, JJCourchay, CVanhoutte, PMLaubie, MVerbeuren, TJ Design, synthesis, and structure-activity relationships of a new series of alpha-adrenergic agonists: spiro[(1,3-diazacyclopent-1-ene)-5,2'-(1',2',3',4'- tetrahydronaphthalene)]. J Med Chem38:4056-69 (1995) Alpha-2A adrenergic receptor
Name:Alpha-2A adrenergic receptor
Type:Enzyme
Mol. Mass.:48979.91
Organism:Homo sapiens (Human)
Description:P08913
Residue:450
BDBM50031311
NameBDBM50031311
Synonyms:7'-methylspiro[4,5-dihydro-1H-imidazole-4,2'-(1',2',3',4'-tetrahydronaphthalene)] | CHEMBL98471
TypeSmall organic molecule
Emp. Form.C13H16N2
Mol. Mass.200.2795
SMILESCc1ccc2CCC3(CNC=N3)Cc2c1