Reaction Details
TargetSodium-dependent dopamine transporter
LigandBDBM50031342
Substrate/Competitorn/a
Meas. Tech.ChEMBL_62621 (CHEMBL678244)
Ki 16±n/a nM
Citation Ma, SLin, LRaghavan, RCohenour, PLin, PYBennett, JLewis, RJEnwall, ELKostrzewa, RLehr, RE In vivo and in vitro studies on the neurotoxic potential of 6-hydroxydopamine analogs. J Med Chem38:4087-97 (1995) Sodium-dependent dopamine transporter
Name:Sodium-dependent dopamine transporter
Type:Multi-pass membrane protein
Mol. Mass.:68749.45
Organism:Rattus norvegicus (rat)
Description:P23977
Residue:619
BDBM50031342
NameBDBM50031342
Synonyms:5-(2-Amino-propyl)-benzene-1,2,4-triol CHEMBL28225
TypeSmall organic molecule
Emp. Form.C9H13NO3
Mol. Mass.183.2044
SMILESCC(N)Cc1cc(O)c(O)cc1O