Reaction Details
TargetTransporter
LigandBDBM50031347
Substrate/Competitorn/a
Meas. Tech.ChEMBL_143119 (CHEMBL748001)
Ki 1±n/a nM
Citation Ma, SLin, LRaghavan, RCohenour, PLin, PYBennett, JLewis, RJEnwall, ELKostrzewa, RLehr, RE In vivo and in vitro studies on the neurotoxic potential of 6-hydroxydopamine analogs. J Med Chem38:4087-97 (1995) Transporter
Name:Transporter
Type:PROTEIN
Mol. Mass.:66787.87
Organism:Rattus norvegicus
Description:ChEMBL_1463061
Residue:597
BDBM50031347
NameBDBM50031347
Synonyms:2-Amino-5-(2-amino-propyl)-benzene-1,4-diol | CHEMBL131383
TypeSmall organic molecule
Emp. Form.C9H14N2O2
Mol. Mass.182.2197
SMILESCC(N)Cc1cc(O)c(N)cc1O