Reaction Details
TargetSodium-dependent dopamine transporter
LigandBDBM50031346
Substrate/Competitorn/a
Meas. Tech.ChEMBL_62621 (CHEMBL678244)
Ki 47±n/a nM
Citation Ma, SLin, LRaghavan, RCohenour, PLin, PYBennett, JLewis, RJEnwall, ELKostrzewa, RLehr, RE In vivo and in vitro studies on the neurotoxic potential of 6-hydroxydopamine analogs. J Med Chem38:4087-97 (1995) Sodium-dependent dopamine transporter
Name:Sodium-dependent dopamine transporter
Type:Multi-pass membrane protein
Mol. Mass.:68749.45
Organism:Rattus norvegicus (rat)
Description:P23977
Residue:619
BDBM50031346
NameBDBM50031346
Synonyms:4-Amino-6-(2-amino-ethyl)-benzene-1,3-diol | CHEMBL130521
TypeSmall organic molecule
Emp. Form.C8H12N2O2
Mol. Mass.168.1931
SMILESNCCc1cc(N)c(O)cc1O