Reaction Details
TargetRetinoic acid receptor RXR-alpha
LigandBDBM50407395
Substrate/Competitorn/a
Meas. Tech.ChEMBL_196784 (CHEMBL799728)
IC50>1000±n/a nM
Citation Alam, MZhestkov, VSani, BPVenepally, PLevin, AAKazmer, SLi, ENorris, AWZhang, XKLee, MO Conformationally defined 6-s-trans-retinoic acid analogs. 2. Selective agonists for nuclear receptor binding and transcriptional activity. J Med Chem38:2302-10 (1995) Retinoic acid receptor RXR-alpha
Name:Retinoic acid receptor RXR-alpha
Type:PROTEIN
Mol. Mass.:51225.80
Organism:Mus musculus
Description:ChEMBL_196493
Residue:467
BDBM50407395
NameBDBM50407395
Synonyms:CHEMBL2111557
TypeSmall organic molecule
Emp. Form.C23H32O2
Mol. Mass.340.499
SMILESCCC1=C(C(C)C)\C(CCC1)=C\C(\C)=C/C=C/C=C/C(=C/C)/C(O)=O