Reaction Details
TargetRetinoic acid receptor gamma
LigandBDBM50031457
Substrate/Competitorn/a
Meas. Tech.ChEMBL_196164 (CHEMBL804937)
IC50 1590±n/a nM
Citation Alam, MZhestkov, VSani, BPVenepally, PLevin, AAKazmer, SLi, ENorris, AWZhang, XKLee, MO Conformationally defined 6-s-trans-retinoic acid analogs. 2. Selective agonists for nuclear receptor binding and transcriptional activity. J Med Chem38:2302-10 (1995) Retinoic acid receptor gamma
Name:Retinoic acid receptor gamma
Type:PROTEIN
Mol. Mass.:50896.02
Organism:Mus musculus
Description:ChEMBL_196161
Residue:458
BDBM50031457
NameBDBM50031457
Synonyms:(2Z,5E)-3-{(E)-3-[3-Ethyl-2-isopropyl-cyclohex-2-en-(E)-ylidene]-2-methyl-propenyl}-5-methyl-hepta-2,5-dienoic acid | CHEMBL72988
TypeSmall organic molecule
Emp. Form.C23H34O2
Mol. Mass.342.5149
SMILESCCC1=C(C(C)C)\C(CCC1)=C\C(\C)=C\C(\C\C(C)=C\C)=C/C(O)=O