Reaction Details
TargetRetinoic acid receptor RXR-alpha
LigandBDBM50031460
Substrate/Competitorn/a
Meas. Tech.ChEMBL_196765 (CHEMBL797917)
Kd>200±n/a nM
Citation Alam, MZhestkov, VSani, BPVenepally, PLevin, AAKazmer, SLi, ENorris, AWZhang, XKLee, MO Conformationally defined 6-s-trans-retinoic acid analogs. 2. Selective agonists for nuclear receptor binding and transcriptional activity. J Med Chem38:2302-10 (1995) Retinoic acid receptor RXR-alpha
Name:Retinoic acid receptor RXR-alpha
Type:PROTEIN
Mol. Mass.:50820.38
Organism:Homo sapiens (Human)
Description:ChEMBL_1456363
Residue:462
BDBM50031460
NameBDBM50031460
Synonyms:(2E,4E,6E)-8-[3-Ethyl-2-isopropyl-cyclohex-2-en-(E)-ylidene]-3,7-dimethyl-octa-2,4,6-trienoic acid | CHEMBL46398
TypeSmall organic molecule
Emp. Form.C21H30O2
Mol. Mass.314.4617
SMILESCCC1=C(C(C)C)\C(CCC1)=C\C(\C)=C\C=C\C(\C)=C\C(O)=O