Reaction Details
TargetCellular retinoic acid-binding protein 1
LigandBDBM31883
Substrate/Competitorn/a
Meas. Tech.ChEMBL_52399 (CHEMBL665903)
Kd 0.4±n/a nM
Citation Alam, MZhestkov, VSani, BPVenepally, PLevin, AAKazmer, SLi, ENorris, AWZhang, XKLee, MO Conformationally defined 6-s-trans-retinoic acid analogs. 2. Selective agonists for nuclear receptor binding and transcriptional activity. J Med Chem38:2302-10 (1995) Cellular retinoic acid-binding protein 1
Name:Cellular retinoic acid-binding protein 1
Type:PROTEIN
Mol. Mass.:15588.40
Organism:Mus musculus
Description:ChEMBL_52399
Residue:137
BDBM31883
NameBDBM31883
Synonyms:9-cis-retinoic acid (9cRA) AT-RA CHEMBL38 SMR000058245 Vitamin A acid [3H]Retinoic acid [3H]tretinoin cid_444795
Typeradiolabeled ligand
Emp. Form.C20H28O2
Mol. Mass.300.4351
SMILESC\C(\C=C\C1=C(C)CCCC1(C)C)=C/C=C/C(/C)=C/C(O)=O