Reaction Details
TargetCellular retinoic acid-binding protein 1
LigandBDBM50407395
Substrate/Competitorn/a
Meas. Tech.ChEMBL_52265 (CHEMBL665218)
IC50 1000±n/a nM
Citation Alam, MZhestkov, VSani, BPVenepally, PLevin, AAKazmer, SLi, ENorris, AWZhang, XKLee, MO Conformationally defined 6-s-trans-retinoic acid analogs. 2. Selective agonists for nuclear receptor binding and transcriptional activity. J Med Chem38:2302-10 (1995) Cellular retinoic acid-binding protein 1
Name:Cellular retinoic acid-binding protein 1
Type:PROTEIN
Mol. Mass.:15660.02
Organism:Gallus gallus
Description:ChEMBL_52265
Residue:137
BDBM50407395
NameBDBM50407395
Synonyms:CHEMBL2111557
TypeSmall organic molecule
Emp. Form.C23H32O2
Mol. Mass.340.499
SMILESCCC1=C(C(C)C)\C(CCC1)=C\C(\C)=C/C=C/C=C/C(=C/C)/C(O)=O