Reaction Details
TargetAlpha-mannosidase 2
LigandBDBM50016703
Substrate/Competitorn/a
Meas. Tech.ChEMBL_32497 (CHEMBL641374)
Ki 35000±n/a nM
Citation Asano, NKizu, HOseki, KTomioka, EMatsui, KOkamoto, MBaba, M N-alkylated nitrogen-in-the-ring sugars: conformational basis of inhibition of glycosidases and HIV-1 replication. J Med Chem38:2349-56 (1995) Alpha-mannosidase 2
Name:Alpha-mannosidase 2
Type:PROTEIN
Mol. Mass.:131265.36
Organism:Rattus norvegicus
Description:ChEMBL_32391
Residue:1148
BDBM50016703
NameBDBM50016703
Synonyms:2-Hydroxymethyl-pyrrolidine-3,4-diol CHEMBL80254 | Imino-D-Arabinitol
TypeSmall organic molecule
Emp. Form.C5H11NO3
Mol. Mass.133.1457
SMILESOC[C@H]1NC[C@@H](O)[C@@H]1O