Reaction Details
TargetLactase/phlorizin hydrolase
LigandBDBM50016703
Substrate/Competitorn/a
Meas. Tech.ChEMBL_96426 (CHEMBL706374)
IC50 260000±n/a nM
Citation Asano, NKizu, HOseki, KTomioka, EMatsui, KOkamoto, MBaba, M N-alkylated nitrogen-in-the-ring sugars: conformational basis of inhibition of glycosidases and HIV-1 replication. J Med Chem38:2349-56 (1995) Lactase/phlorizin hydrolase
Name:Lactase/phlorizin hydrolase
Type:PROTEIN
Mol. Mass.:217253.31
Organism:Rattus norvegicus
Description:ChEMBL_96426
Residue:1928
BDBM50016703
NameBDBM50016703
Synonyms:2-Hydroxymethyl-pyrrolidine-3,4-diol CHEMBL80254 | Imino-D-Arabinitol
TypeSmall organic molecule
Emp. Form.C5H11NO3
Mol. Mass.133.1457
SMILESOC[C@H]1NC[C@@H](O)[C@@H]1O