Reaction Details
TargetLactase/phlorizin hydrolase
LigandBDBM50031482
Substrate/Competitorn/a
Meas. Tech.ChEMBL_96426 (CHEMBL706374)
IC50<50000±n/a nM
Citation Asano, NKizu, HOseki, KTomioka, EMatsui, KOkamoto, MBaba, M N-alkylated nitrogen-in-the-ring sugars: conformational basis of inhibition of glycosidases and HIV-1 replication. J Med Chem38:2349-56 (1995) Lactase/phlorizin hydrolase
Name:Lactase/phlorizin hydrolase
Type:PROTEIN
Mol. Mass.:217253.31
Organism:Rattus norvegicus
Description:ChEMBL_96426
Residue:1928
BDBM50031482
NameBDBM50031482
Synonyms:(2R,3R,4R,5R)-1-Butyl-2,5-bis-hydroxymethyl-pyrrolidine-3,4-diol | CHEMBL77918
TypeSmall organic molecule
Emp. Form.C10H21NO4
Mol. Mass.219.278
SMILESCCCCN1[C@H](CO)[C@@H](O)[C@H](O)[C@H]1CO