Reaction Details
TargetAlpha-mannosidase 2
LigandBDBM18353
Substrate/Competitorn/a
Meas. Tech.ChEMBL_32497 (CHEMBL641374)
Ki<50000±n/a nM
Citation Asano, NKizu, HOseki, KTomioka, EMatsui, KOkamoto, MBaba, M N-alkylated nitrogen-in-the-ring sugars: conformational basis of inhibition of glycosidases and HIV-1 replication. J Med Chem38:2349-56 (1995) Alpha-mannosidase 2
Name:Alpha-mannosidase 2
Type:PROTEIN
Mol. Mass.:131265.36
Organism:Rattus norvegicus
Description:ChEMBL_32391
Residue:1148
BDBM18353
NameBDBM18353
Synonyms:(2R,3R,4R,5S)-2-(hydroxymethyl)-1-methylpiperidine-3,4,5-triol N-Methyl-DNJ | US9181184, 2
Typenatural product
Emp. Form.C7H15NO4
Mol. Mass.177.1983
SMILESCN1C[C@H](O)[C@@H](O)[C@H](O)[C@H]1CO