Reaction Details
TargetAlpha-mannosidase
LigandBDBM50031483
Substrate/Competitorn/a
Meas. Tech.ChEMBL_32498 (CHEMBL641375)
IC50<50000±n/a nM
Citation Asano, NKizu, HOseki, KTomioka, EMatsui, KOkamoto, MBaba, M N-alkylated nitrogen-in-the-ring sugars: conformational basis of inhibition of glycosidases and HIV-1 replication. J Med Chem38:2349-56 (1995) Alpha-mannosidase
Name:Alpha-mannosidase
Synonyms:Mannosidase 2, alpha B1
Type:PROTEIN
Mol. Mass.:114350.15
Organism:Rattus norvegicus
Description:ChEMBL_32498
Residue:1009
BDBM50031483
NameBDBM50031483
TypeSmall organic molecule
Emp. Form.C7H15NO4
Mol. Mass.177.1983
SMILESCN1[C@H](CO)[C@@H](O)[C@H](O)[C@H]1CO