Reaction Details
TargetAlpha-mannosidase 2
LigandBDBM50031484
Substrate/Competitorn/a
Meas. Tech.ChEMBL_32391 (CHEMBL647923)
IC50 130000±n/a nM
Citation Asano, NKizu, HOseki, KTomioka, EMatsui, KOkamoto, MBaba, M N-alkylated nitrogen-in-the-ring sugars: conformational basis of inhibition of glycosidases and HIV-1 replication. J Med Chem38:2349-56 (1995) Alpha-mannosidase 2
Name:Alpha-mannosidase 2
Type:PROTEIN
Mol. Mass.:131265.36
Organism:Rattus norvegicus
Description:ChEMBL_32391
Residue:1148
BDBM50031484
NameBDBM50031484
Synonyms:(2R,3R,4R)-1-Butyl-2-hydroxymethyl-pyrrolidine-3,4-diol | CHEMBL310229
TypeSmall organic molecule
Emp. Form.C9H19NO3
Mol. Mass.189.2521
SMILESCCCCN1C[C@@H](O)[C@H](O)[C@H]1CO