Reaction Details
TargetMu-type opioid receptor
LigandBDBM50031571
Substrate/Competitorn/a
Meas. Tech.ChEMBL_149001 (CHEMBL757985)
Ki 10.2±n/a nM
Citation Arttamangkul, SMurray, TFDeLander, GEAldrich, JV Synthesis and opioid activity of conformationally constrained dynorphin A analogues. 1. Conformational constraint in the"message" sequence. J Med Chem38:2410-7 (1995) Mu-type opioid receptor
Name:Mu-type opioid receptor
Type:G Protein-Coupled Receptor (GPCR)
Mol. Mass.:44503.11
Organism:Rattus norvegicus (rat)
Description:Competition binding assays were carried out using membrane preparations from transfected HN9.10 cells that constitutively expressed the mu opioid receptor.
Residue:398
BDBM50031571
NameBDBM50031571
Synonyms:CHEMBL2369883 | cyclo[D-Asp2,Dap5]Dyn A-(1-13)NH2
TypeSmall organic molecule
Emp. Form.C74H122N26O15
Mol. Mass.1615.9257
SMILES[#6]-[#6]-[#6@H](-[#6])-[#6@H](-[#7]-[#6](=O)-[#6@H](-[#6]-[#6]-[#6]\[#7]=[#6](\[#7])-[#7])-[#7]-[#6](=O)-[#6@H](-[#6]-[#6]-[#6]\[#7]=[#6](\[#7])-[#7])-[#7]-[#6](=O)-[#6@@H]-1-[#6]-[#7]-[#6](=O)-[#6]-[#6@@H](-[#7]-[#6](=O)-[#6@@H](-[#7])-[#6]-c2ccc(-[#8])cc2)-[#6](=O)-[#7]-[#6]-[#6](=O)-[#7]-[#6@@H](-[#6]-c2ccccc2)-[#6](=O)-[#7]-1)-[#6](=O)-[#7]-[#6@@H](-[#6]-[#6]-[#6]\[#7]=[#6](\[#7])-[#7])-[#6](=O)-[#7]-1-[#6]-[#6]-[#6]-[#6@@H]-1-[#6](=O)-[#7]-[#6@@H](-[#6]-[#6]-[#6]-[#6]-[#7])-[#6](=O)-[#7]-[#6@@H](-[#6]-[#6](-[#6])-[#6])-[#6](=O)-[#7]-[#6@@H](-[#6]-[#6]-[#6]-[#6]-[#7])-[#6](-[#7])=O