Reaction Details
TargetSteroid 17-alpha-hydroxylase/17,20 lyase
LigandBDBM50031677
Substrate/Competitorn/a
Meas. Tech.ChEMBL_50394 (CHEMBL662850)
IC50 1.8±n/a nM
Citation Potter, GABarrie, SEJarman, MRowlands, MG Novel steroidal inhibitors of human cytochrome P45017 alpha (17 alpha-hydroxylase-C17,20-lyase): potential agents for the treatment of prostatic cancer. J Med Chem38:2463-71 (1995) Steroid 17-alpha-hydroxylase/17,20 lyase
Name:Steroid 17-alpha-hydroxylase/17,20 lyase
Type:Enzyme
Mol. Mass.:57382.42
Organism:Homo sapiens (Human)
Description:E.coli expressing human CYP17
Residue:508
BDBM50031677
NameBDBM50031677
Synonyms:(S)-13-Methyl-17-pyridin-3-yl-7,8,9,11,12,13,14,15-octahydro-6H-cyclopenta[a]phenanthren-3-ol | CHEMBL310662
TypeSmall organic molecule
Emp. Form.C23H25NO
Mol. Mass.331.4507
SMILESC[C@]12CCC3C(CCc4cc(O)ccc34)C1CC=C2c1cccnc1