Reaction Details
TargetSteroid 17-alpha-hydroxylase/17,20 lyase
LigandBDBM50031665
Substrate/Competitorn/a
Meas. Tech.ChEMBL_50394 (CHEMBL662850)
IC50 2.9±n/a nM
Citation Potter, GABarrie, SEJarman, MRowlands, MG Novel steroidal inhibitors of human cytochrome P45017 alpha (17 alpha-hydroxylase-C17,20-lyase): potential agents for the treatment of prostatic cancer. J Med Chem38:2463-71 (1995) Steroid 17-alpha-hydroxylase/17,20 lyase
Name:Steroid 17-alpha-hydroxylase/17,20 lyase
Type:Enzyme
Mol. Mass.:57382.42
Organism:Homo sapiens (Human)
Description:E.coli expressing human CYP17
Residue:508
BDBM50031665
NameBDBM50031665
Synonyms:(10R,13S)-10,13-Dimethyl-17-pyridin-3-yl-1,6,7,8,9,10,12,13,14,15-decahydro-2H-cyclopenta[a]phenanthrene-3,11-dione | CHEMBL311444
TypeSmall organic molecule
Emp. Form.C24H27NO2
Mol. Mass.361.4767
SMILESC[C@]12CC(=O)C3C(CCC4=CC(=O)CC[C@]34C)C1CC=C2c1cccnc1