Reaction Details
TargetPlasminogen
LigandBDBM50031708
Substrate/Competitorn/a
Meas. Tech.ChEMBL_155580 (CHEMBL759955)
IC50 873±n/a nM
Citation Senokuchi, KNakai, HNakayama, YOdagaki, YSakaki, KKato, MMaruyama, TMiyazaki, TIto, HKamiyasu, K New orally active serine protease inhibitors. J Med Chem38:2521-3 (1995) Plasminogen
Name:Plasminogen
Type:Protein
Mol. Mass.:90541.87
Organism:Rattus norvegicus
Description:Q01177
Residue:812
BDBM50031708
NameBDBM50031708
Synonyms:4-[(E)-2-(Allyl-ethoxycarbonylmethyl-carbamoyl)-propenyl]-benzoic acid 4-carbamimidoyl-phenyl ester; compound with methanesulfonic acid | CHEMBL85136
TypeSmall organic molecule
Emp. Form.C25H27N3O5
Mol. Mass.449.499
SMILESCCOC(=O)CN(CC=C)C(=O)C(\C)=C\c1ccc(cc1)C(=O)Oc1ccc(cc1)C(N)=N