Reaction Details
TargetChymotrypsinogen A
LigandBDBM50031707
Substrate/Competitorn/a
Meas. Tech.ChEMBL_49466 (CHEMBL657110)
IC50>100000±n/a nM
Citation Senokuchi, KNakai, HNakayama, YOdagaki, YSakaki, KKato, MMaruyama, TMiyazaki, TIto, HKamiyasu, K New orally active serine protease inhibitors. J Med Chem38:2521-3 (1995) Chymotrypsinogen A
Name:Chymotrypsinogen A
Type:Serine protease
Mol. Mass.:25670.88
Organism:Bos taurus (bovine)
Description:n/a
Residue:245
BDBM50031707
NameBDBM50031707
Synonyms:4-[(E)-2-(Allyl-carboxymethyl-carbamoyl)-propenyl]-benzoic acid 4-carbamimidoyl-phenyl ester; compound with methanesulfonic acid | CHEMBL85154
TypeSmall organic molecule
Emp. Form.C23H23N3O5
Mol. Mass.421.4458
SMILESC\C(=C/c1ccc(cc1)C(=O)Oc1ccc(cc1)C(N)=N)C(=O)N(CC=C)CC(O)=O