Reaction Details
TargetProthrombin
LigandBDBM50031706
Substrate/Competitorn/a
Meas. Tech.ChEMBL_209070 (CHEMBL809536)
IC50 31600±n/a nM
Citation Senokuchi, KNakai, HNakayama, YOdagaki, YSakaki, KKato, MMaruyama, TMiyazaki, TIto, HKamiyasu, K New orally active serine protease inhibitors. J Med Chem38:2521-3 (1995) Prothrombin
Name:Prothrombin
Type:Protein
Mol. Mass.:70029.57
Organism:Homo sapiens (Human)
Description:P00734
Residue:622
BDBM50031706
NameBDBM50031706
Synonyms:4-Guanidino-benzoic acid 4-dimethylcarbamoylmethoxycarbonylmethyl-phenyl ester; compound with methanesulfonic acid Camostat | med.21724, Compound 18
TypeSmall organic molecule
Emp. Form.C20H22N4O5
Mol. Mass.398.4125
SMILES[#6]-[#7](-[#6])-[#6](=O)-[#6]-[#8]-[#6](=O)-[#6]-c1ccc(-[#8]-[#6](=O)-c2ccc(cc2)\[#7]=[#6](/[#7])-[#7])cc1