Reaction Details
TargetCathepsin G
LigandBDBM50031706
Substrate/Competitorn/a
Meas. Tech.ChEMBL_45348 (CHEMBL884103)
IC50>100000±n/a nM
Citation Senokuchi, KNakai, HNakayama, YOdagaki, YSakaki, KKato, MMaruyama, TMiyazaki, TIto, HKamiyasu, K New orally active serine protease inhibitors. J Med Chem38:2521-3 (1995) Cathepsin G
Name:Cathepsin G
Type:PROTEIN
Mol. Mass.:28860.08
Organism:Homo sapiens (Human)
Description:ChEMBL_1469016
Residue:255
BDBM50031706
NameBDBM50031706
Synonyms:4-Guanidino-benzoic acid 4-dimethylcarbamoylmethoxycarbonylmethyl-phenyl ester; compound with methanesulfonic acid Camostat | med.21724, Compound 18
TypeSmall organic molecule
Emp. Form.C20H22N4O5
Mol. Mass.398.4125
SMILES[#6]-[#7](-[#6])-[#6](=O)-[#6]-[#8]-[#6](=O)-[#6]-c1ccc(-[#8]-[#6](=O)-c2ccc(cc2)\[#7]=[#6](/[#7])-[#7])cc1