Reaction Details
TargetNeutrophil collagenase
LigandBDBM50031785
Substrate/Competitorn/a
Meas. Tech.ChEMBL_49517 (CHEMBL660241)
Ki 7.0±n/a nM
Citation Gowravaram, MRTomczuk, BEJohnson, JSDelecki, DCook, ERGhose, AKMathiowetz, AMSpurlino, JCRubin, BSmith, DL Inhibition of matrix metalloproteinases by hydroxamates containing heteroatom-based modifications of the P1' group. J Med Chem38:2570-81 (1995) Neutrophil collagenase
Name:Neutrophil collagenase
Type:Enzyme
Mol. Mass.:53413.48
Organism:Homo sapiens (Human)
Description:P22894
Residue:467
BDBM50031785
NameBDBM50031785
Synonyms:(R)-N*4*-Hydroxy-2-(4-hydroxy-butyl)-N*1*-((S)-1-methylcarbamoyl-2-phenyl-ethyl)-succinamide CHEMBL86468
TypeSmall organic molecule
Emp. Form.C18H27N3O5
Mol. Mass.365.4241
SMILESCNC(=O)[C@H](Cc1ccccc1)NC(=O)[C@H](CCCCO)CC(=O)NO