Reaction Details
TargetStromelysin-1
LigandBDBM50031792
Substrate/Competitorn/a
Meas. Tech.ChEMBL_205626 (CHEMBL812385)
Ki 6±n/a nM
Citation Gowravaram, MRTomczuk, BEJohnson, JSDelecki, DCook, ERGhose, AKMathiowetz, AMSpurlino, JCRubin, BSmith, DL Inhibition of matrix metalloproteinases by hydroxamates containing heteroatom-based modifications of the P1' group. J Med Chem38:2570-81 (1995) Stromelysin-1
Name:Stromelysin-1
Type:Enzyme
Mol. Mass.:53973.13
Organism:Homo sapiens (Human)
Description: P08254
Residue:477
BDBM50031792
NameBDBM50031792
Synonyms:(R)-2-[4-(4-Chloro-phenoxy)-butyl]-N*1*-[(S)-2,2-dimethyl-1-(2-pyridin-2-yl-ethylcarbamoyl)-propyl]-N*4*-hydroxy-succinamide | CHEMBL87113
TypeSmall organic molecule
Emp. Form.C27H37ClN4O5
Mol. Mass.533.059
SMILESCC(C)(C)[C@H](NC(=O)[C@H](CCCCOc1ccc(Cl)cc1)CC(=O)NO)C(=O)NCCc1ccccn1