Reaction Details
TargetStromelysin-1
LigandBDBM50031775
Substrate/Competitorn/a
Meas. Tech.ChEMBL_205626 (CHEMBL812385)
Ki 2±n/a nM
Citation Gowravaram, MRTomczuk, BEJohnson, JSDelecki, DCook, ERGhose, AKMathiowetz, AMSpurlino, JCRubin, BSmith, DL Inhibition of matrix metalloproteinases by hydroxamates containing heteroatom-based modifications of the P1' group. J Med Chem38:2570-81 (1995) Stromelysin-1
Name:Stromelysin-1
Type:Enzyme
Mol. Mass.:53973.13
Organism:Homo sapiens (Human)
Description: P08254
Residue:477
BDBM50031775
NameBDBM50031775
Synonyms:4-[(S)-2-((R)-2-Hydroxycarbamoylmethyl-6-phenoxy-hexanoylamino)-3,3-dimethyl-butyrylamino]-butyric acid | CHEMBL431408
TypeSmall organic molecule
Emp. Form.C24H37N3O7
Mol. Mass.479.5665
SMILESCC(C)(C)[C@H](NC(=O)[C@H](CCCCOc1ccccc1)CC(=O)NO)C(=O)NCCCC(O)=O