Reaction Details
TargetType-1 angiotensin II receptor
LigandBDBM50031957
Substrate/Competitorn/a
Meas. Tech.ChEMBL_36797 (CHEMBL650317)
Ki 0.49±n/a nM
Citation Kiyama, RHonma, THayashi, KOgawa, MHara, MFujimoto, MFujishita, T Novel angiotensin II receptor antagonists. Design, synthesis, and in vitro evaluation of dibenzo[a,d]cycloheptene and dibenzo[b,f]oxepin derivatives. Searching for bioisosteres of biphenylyltetrazole using a three-dimensional search technique. J Med Chem38:2728-41 (1995) Type-1 angiotensin II receptor
Name:Type-1 angiotensin II receptor
Type:Protein
Mol. Mass.:41080.75
Organism:Homo sapiens (Human)
Description:P30556
Residue:359
BDBM50031957
NameBDBM50031957
Synonyms:5,7-Dimethyl-2-propyl-3-[11-(1H-tetrazol-5-yl)-5H-dibenzo[a,d]cyclohepten-3-ylmethyl]-3H-imidazo[4,5-b]pyridine | CHEMBL93159
TypeSmall organic molecule
Emp. Form.C28H27N7
Mol. Mass.461.5609
SMILESCCCc1nc2c(C)cc(C)nc2n1Cc1ccc2c(Cc3ccccc3C=C2c2nnn[nH]2)c1