Reaction Details
TargetType-1 angiotensin II receptor
LigandBDBM50031966
Substrate/Competitorn/a
Meas. Tech.ChEMBL_36797 (CHEMBL650317)
Ki 2.7±n/a nM
Citation Kiyama, RHonma, THayashi, KOgawa, MHara, MFujimoto, MFujishita, T Novel angiotensin II receptor antagonists. Design, synthesis, and in vitro evaluation of dibenzo[a,d]cycloheptene and dibenzo[b,f]oxepin derivatives. Searching for bioisosteres of biphenylyltetrazole using a three-dimensional search technique. J Med Chem38:2728-41 (1995) Type-1 angiotensin II receptor
Name:Type-1 angiotensin II receptor
Type:Protein
Mol. Mass.:41080.75
Organism:Homo sapiens (Human)
Description:P30556
Residue:359
BDBM50031966
NameBDBM50031966
Synonyms:2-Ethoxy-3-[5-oxo-11-(1H-tetrazol-5-yl)-5H-dibenzo[a,d]cyclohepten-3-ylmethyl]-3H-benzoimidazole-4-carboxylic acid | CHEMBL328296
TypeSmall organic molecule
Emp. Form.C27H20N6O4
Mol. Mass.492.4855
SMILESCCOc1nc2cccc(C(O)=O)c2n1Cc1ccc2c(cc3ccccc3c(=O)c2c1)-c1nnn[nH]1