Reaction Details
TargetType-1 angiotensin II receptor
LigandBDBM50031965
Substrate/Competitorn/a
Meas. Tech.ChEMBL_36797 (CHEMBL650317)
Ki 2.7±n/a nM
Citation Kiyama, RHonma, THayashi, KOgawa, MHara, MFujimoto, MFujishita, T Novel angiotensin II receptor antagonists. Design, synthesis, and in vitro evaluation of dibenzo[a,d]cycloheptene and dibenzo[b,f]oxepin derivatives. Searching for bioisosteres of biphenylyltetrazole using a three-dimensional search technique. J Med Chem38:2728-41 (1995) Type-1 angiotensin II receptor
Name:Type-1 angiotensin II receptor
Type:Protein
Mol. Mass.:41080.75
Organism:Homo sapiens (Human)
Description:P30556
Residue:359
BDBM50031965
NameBDBM50031965
Synonyms:2-Ethyl-4-[5-oxo-11-(1H-tetrazol-5-yl)-5H-dibenzo[a,d]cyclohepten-3-ylmethoxy]-quinoline-6-carboxylic acid | CHEMBL330508
TypeSmall organic molecule
Emp. Form.C29H21N5O4
Mol. Mass.503.5081
SMILESCCc1cc(OCc2ccc3c(cc4ccccc4c(=O)c3c2)-c2nnn[nH]2)c2cc(ccc2n1)C(O)=O