Reaction Details
TargetPotassium-transporting ATPase alpha chain 1/subunit beta
LigandBDBM50032116
Substrate/Competitorn/a
Meas. Tech.ChEMBL_76069 (CHEMBL688290)
IC50 32±n/a nM
Citation Ife, RJBrown, THBlurton, PKeeling, DJLeach, CAMeeson, MLParsons, METheobald, CJ Reversible inhibitors of the gastric (H+/K+)-ATPase. 5. Substituted 2,4-diaminoquinazolines and thienopyrimidines. J Med Chem38:2763-73 (1995) Potassium-transporting ATPase alpha chain 1/subunit beta
Name:Potassium-transporting ATPase alpha chain 1/subunit beta
Type:n/a
Mol. Mass.:n/a
Description:n/a
Components:This complex has 0 components.
Component 1
Name:Potassium-transporting ATPase subunit beta
Synonyms:ATP4B Gastric H(+)/K(+) ATPase subunit beta Potassium-transporting ATPase beta chain Proton pump beta chain | gp60-90
Type:n/a
Mol. Mass.:33083.09
Organism:Sus scrofa (Pig)
Description:n/a
Residue:290
Component 2
Name:Potassium-transporting ATPase alpha chain 1
Synonyms:ATP4A Gastric H(+)/K(+) ATPase subunit alpha Na/K-ATPase Potassium-transporting ATPase alpha chain 1 | Proton pump
Type:Enzyme
Mol. Mass.:114279.23
Organism:Sus scrofa (Pig)
Description:P19156
Residue:1034
BDBM50032116
NameBDBM50032116
Synonyms:CHEMBL420621 | N*2*-(4-Fluoro-2-methyl-phenyl)-8-methoxy-N*4*-methyl-N*4*-phenyl-quinazoline-2,4-diamine
TypeSmall organic molecule
Emp. Form.C23H21FN4O
Mol. Mass.388.4374
SMILESCOc1cccc2c(nc(Nc3ccc(F)cc3C)nc12)N(C)c1ccccc1