Reaction Details
TargetPotassium-transporting ATPase alpha chain 1/subunit beta
LigandBDBM50032123
Substrate/Competitorn/a
Meas. Tech.ChEMBL_76069 (CHEMBL688290)
IC50 21±n/a nM
Citation Ife, RJBrown, THBlurton, PKeeling, DJLeach, CAMeeson, MLParsons, METheobald, CJ Reversible inhibitors of the gastric (H+/K+)-ATPase. 5. Substituted 2,4-diaminoquinazolines and thienopyrimidines. J Med Chem38:2763-73 (1995) Potassium-transporting ATPase alpha chain 1/subunit beta
Name:Potassium-transporting ATPase alpha chain 1/subunit beta
Type:n/a
Mol. Mass.:n/a
Description:n/a
Components:This complex has 0 components.
Component 1
Name:Potassium-transporting ATPase subunit beta
Synonyms:ATP4B Gastric H(+)/K(+) ATPase subunit beta Potassium-transporting ATPase beta chain Proton pump beta chain | gp60-90
Type:n/a
Mol. Mass.:33083.09
Organism:Sus scrofa (Pig)
Description:n/a
Residue:290
Component 2
Name:Potassium-transporting ATPase alpha chain 1
Synonyms:ATP4A Gastric H(+)/K(+) ATPase subunit alpha Na/K-ATPase Potassium-transporting ATPase alpha chain 1 | Proton pump
Type:Enzyme
Mol. Mass.:114279.23
Organism:Sus scrofa (Pig)
Description:P19156
Residue:1034
BDBM50032123
NameBDBM50032123
Synonyms:8-(3-Dimethylamino-propoxy)-N*4*-methyl-N*4*-phenyl-N*2*-o-tolyl-quinazoline-2,4-diamine | CHEMBL92833
TypeSmall organic molecule
Emp. Form.C27H31N5O
Mol. Mass.441.5679
SMILESCN(C)CCCOc1cccc2c(nc(Nc3ccccc3C)nc12)N(C)c1ccccc1